Reaction Details
TargetCasein kinase I isoform delta
LigandBDBM50008512
Substrate/Competitorn/a
Meas. Tech.ChEMBL_1334961 (CHEMBL3239314)
IC50 15±n/a nM
Citation Salado, IGRedondo, MBello, MLPerez, CLiachko, NFKraemer, BCMiguel, LLecourtois, MGil, CMartinez, APerez, DI Protein kinase CK-1 inhibitors as new potential drugs for amyotrophic lateral sclerosis. J Med Chem57:2755-72 (2014) 
 
Casein kinase I isoform delta
Name:Casein kinase I isoform delta
Type:Enzyme
Mol. Mass.:47356.76
Organism:Homo sapiens (Human)
Description:P48730
Residue:415
BDBM50008512
NameBDBM50008512
Synonyms:CHEMBL3235572
TypeSmall organic molecule
Emp. Form.C19H17F3N2O4S
Mol. Mass.426.409
SMILESCOc1cc(CC(=O)Nc2nc3ccc(cc3s2)C(F)(F)F)cc(OC)c1OC