Reaction Details
TargetGlycogen phosphorylase, muscle form
LigandBDBM50009066
Substrate/Competitorn/a
Meas. Tech.ChEMBL_1338433 (CHEMBL3240699)
Ki 2100±n/a nM
Citation Kun, SBokor, ÉVarga, GSzocs, BPáhi, ACzifrák, KTóth, MJuhász, LDocsa, TGergely, PSomsák, L New synthesis of 3-(ß-D-glucopyranosyl)-5-substituted-1,2,4-triazoles, nanomolar inhibitors of glycogen phosphorylase. Eur J Med Chem76:567-79 (2014) 
 
Glycogen phosphorylase, muscle form
Name:Glycogen phosphorylase, muscle form
Type:Enzyme
Mol. Mass.:97296.32
Organism:Oryctolagus cuniculus (rabbit)
Description:Phosphorylation of Ser-15 converts phosphorylase B (unphosphorylated) to phosphorylase A.
Residue:843
BDBM50009066
NameBDBM50009066
Synonyms:CHEMBL3237963
TypeSmall organic molecule
Emp. Form.C17H18N2O5
Mol. Mass.330.3352
SMILESOC[C@H]1O[C@H]([C@H](O)[C@@H](O)[C@@H]1O)c1nc2cc3ccccc3cc2[nH]1