Reaction Details
TargetChromobox protein homolog 7
LigandBDBM50009554
Substrate/Competitorn/a
Meas. Tech.ChEMBL_1336412 (CHEMBL3242416)
Kd 200±n/a nM
Citation Simhadri, CDaze, KDDouglas, SFQuon, TTDev, AGignac, MCPeng, FHeller, MBoulanger, MJWulff, JEHof, F Chromodomain antagonists that target the polycomb-group methyllysine reader protein chromobox homolog 7 (CBX7). J Med Chem57:2874-83 (2014) 
 
Chromobox protein homolog 7
Name:Chromobox protein homolog 7
Type:Protein
Mol. Mass.:28351.76
Organism:Homo sapiens (Human)
Description:n/a
Residue:251
BDBM50009554
NameBDBM50009554
Synonyms:CHEMBL3234442
TypeSmall organic molecule
Emp. Form.C40H58N7O9
Mol. Mass.780.9295
SMILESCOC(=O)c1ccc(cc1)C(=O)N[C@@H](Cc1ccccc1)C(=O)N[C@@H](C)C(=O)N[C@@H](C1CCCC1)C(=O)N[C@@H](CCCC[N+](C)(C)C)C(=O)N[C@H](CO)C(N)=O