Reaction Details
TargetChromobox protein homolog 1
LigandBDBM50009454
Substrate/Competitorn/a
Meas. Tech.ChEMBL_1336415 (CHEMBL3242419)
Kd 43000±n/a nM
Citation Simhadri, CDaze, KDDouglas, SFQuon, TTDev, AGignac, MCPeng, FHeller, MBoulanger, MJWulff, JEHof, F Chromodomain antagonists that target the polycomb-group methyllysine reader protein chromobox homolog 7 (CBX7). J Med Chem57:2874-83 (2014) 
 
Chromobox protein homolog 1
Name:Chromobox protein homolog 1
Type:PROTEIN
Mol. Mass.:21405.43
Organism:Homo sapiens (Human)
Description:ChEMBL_103989
Residue:185
BDBM50009454
NameBDBM50009454
Synonyms:CHEMBL3234136
TypeSmall organic molecule
Emp. Form.C32H54N7O7
Mol. Mass.648.8133
SMILESCC(C)C[C@H](NC(=O)[C@H](C)NC(=O)[C@H](Cc1ccccc1)NC(C)=O)C(=O)N[C@@H](CCCC[N+](C)(C)C)C(=O)N[C@@H](CO)C(N)=O