Reaction Details
TargetType-1 angiotensin II receptor
LigandBDBM50009560
Substrate/Competitorn/a
Meas. Tech.ChEMBL_1336425 (CHEMBL3242429)
Ki 98000±n/a nM
Citation Margathe, JFIturrioz, XAlvear-Perez, RMarsol, CRiché, SChabane, HTounsi, NKuhry, MHeissler, DHibert, MLlorens-Cortes, CBonnet, D Structure-activity relationship studies toward the discovery of selective apelin receptor agonists. J Med Chem57:2908-19 (2014) 
 
Type-1 angiotensin II receptor
Name:Type-1 angiotensin II receptor
Type:Protein
Mol. Mass.:41080.75
Organism:Homo sapiens (Human)
Description:P30556
Residue:359
BDBM50009560
NameBDBM50009560
Synonyms:CHEMBL3234454
TypeSmall organic molecule
Emp. Form.C65H80F9N11O14S3
Mol. Mass.1506.577
SMILES[O-]C(=O)C(F)(F)F.[O-]C(=O)C(F)(F)F.[O-]C(=O)C(F)(F)F.CCN(CC)c1ccc(cc1)C(=C1C=CC(C=C1)=[N+](CC)CC)c1ccc(cc1S([O-])(=O)=O)S(=O)(=O)NCCCC[C@H](NC(=O)Cc1csc(=[NH2+])n1C)C(=O)N[C@@H](Cc1cn(Cc2ccccc2)c[n+]1C)C(=O)NC1CC[NH+](C)CC1