Reaction Details
TargetApelin
LigandBDBM50009559
Substrate/Competitorn/a
Meas. Tech.ChEMBL_1336427 (CHEMBL3242431)
IC50 3000±n/a nM
Citation Margathe, JFIturrioz, XAlvear-Perez, RMarsol, CRiché, SChabane, HTounsi, NKuhry, MHeissler, DHibert, MLlorens-Cortes, CBonnet, D Structure-activity relationship studies toward the discovery of selective apelin receptor agonists. J Med Chem57:2908-19 (2014) 
 
Apelin
Name:Apelin
Type:PROTEIN
Mol. Mass.:8687.84
Organism:Rattus norvegicus
Description:ChEMBL_108274
Residue:77
BDBM50009559
NameBDBM50009559
Synonyms:CHEMBL3234453
TypeSmall organic molecule
Emp. Form.C65H78F9N11O15S3
Mol. Mass.1520.56
SMILES[O-]C(=O)C(F)(F)F.[O-]C(=O)C(F)(F)F.[O-]C(=O)C(F)(F)F.CCN(CC)c1ccc2c(-c3ccc(cc3S([O-])(=O)=O)S(=O)(=O)NCCCC[C@H](NC(=O)Cc3csc(=[NH2+])n3C)C(=O)N[C@@H](Cc3cn(Cc4ccccc4)c[n+]3C)C(=O)NC3CC[NH+](C)CC3)c3ccc(cc3oc2c1)=[N+](CC)CC