Reaction Details
TargetMonoacylglycerol lipase ABHD6
LigandBDBM50010336
Substrate/Competitorn/a
Meas. Tech.ChEMBL_1352819 (CHEMBL3268615)
IC50 0.210000±n/a nM
Citation Chang, JWHsu, KLTsuboi, KWhitby, LRPugh, H Discovery and optimization of piperidyl-1,2,3-triazole ureas as potent, selective, and in vivo-active inhibitors of a/ß-hydrolase domain containing 6 (ABHD6). Cell Chem Biol56:8270-9 (2013) 
 
Monoacylglycerol lipase ABHD6
Name:Monoacylglycerol lipase ABHD6
Type:Single-pass type II membrane protein; hydrolase
Mol. Mass.:38216.17
Organism:Mus musculus (mouse)
Description:Assays were using membranes of recombinant Abh6 transiently transfected in COS-7 cells.
Residue:336
BDBM50010336
NameBDBM50010336
Synonyms:CHEMBL3263579
TypeSmall organic molecule
Emp. Form.C32H33N5O2
Mol. Mass.519.6367
SMILESO=C(N1CCCCC1)c1cccc(c1)-c1ccc(cc1)-c1cn(nn1)C(=O)N1CCCCC1c1ccccc1