Reaction Details
TargetHistone-lysine N-methyltransferase EHMT1
LigandBDBM50010380
Substrate/Competitorn/a
Meas. Tech.ChEMBL_1353169 (CHEMBL3266271)
IC50 1500±n/a nM
Citation Devkota, KLohse, BLiu, QWang, MWStærk, DBerthelsen, JClausen, RP Analogues of the Natural Product Sinefungin as Inhibitors of EHMT1 and EHMT2. ACS Med Chem Lett5:293-7 (2014) 
 
Histone-lysine N-methyltransferase EHMT1
Name:Histone-lysine N-methyltransferase EHMT1
Type:PROTEIN
Mol. Mass.:141443.67
Organism:Homo sapiens (Human)
Description:ChEMBL_1450367
Residue:1298
BDBM50010380
NameBDBM50010380
Synonyms:CHEMBL3263626
TypeSmall organic molecule
Emp. Form.C18H28N6O3
Mol. Mass.376.4533
SMILESNC(C[C@H]1O[C@H]([C@H](O)[C@@H]1O)n1cnc2c(N)ncnc12)CC1CCCCC1