Reaction Details
TargetEpidermal growth factor receptor
LigandBDBM50010384
Substrate/Competitorn/a
Meas. Tech.ChEMBL_1353177 (CHEMBL3266279)
IC50 3860±n/a nM
Citation Szokol, BGyulavári, PKurkó, IBaska, FSzántai-Kis, CGreff, ZOrfi, ZPeták, IPénzes, KTorka, RUllrich, AOrfi, LVántus, TKéri, G Discovery and Biological Evaluation of Novel Dual EGFR/c-Met Inhibitors. ACS Med Chem Lett5:298-303 (2014) 
 
Epidermal growth factor receptor
Name:Epidermal growth factor receptor
Type:Receptor Kinase Domain
Mol. Mass.:134279.59
Organism:Homo sapiens (Human)
Description:P00533
Residue:1210
BDBM50010384
NameBDBM50010384
Synonyms:CHEMBL3263960
TypeSmall organic molecule
Emp. Form.C33H32FN3O7S
Mol. Mass.633.686
SMILESCOc1cc2c(Oc3ccc(NS(=O)(=O)c4cccc(c4)-c4ccoc4)cc3F)ccnc2cc1OCCCN1CCOCC1