Reaction Details
TargetEpidermal growth factor receptor
LigandBDBM50315887
Substrate/Competitorn/a
Meas. Tech.ChEMBL_1353177 (CHEMBL3266279)
IC50>12500±n/a nM
Citation Szokol, BGyulavári, PKurkó, IBaska, FSzántai-Kis, CGreff, ZOrfi, ZPeták, IPénzes, KTorka, RUllrich, AOrfi, LVántus, TKéri, G Discovery and Biological Evaluation of Novel Dual EGFR/c-Met Inhibitors. ACS Med Chem Lett5:298-303 (2014) 
 
Epidermal growth factor receptor
Name:Epidermal growth factor receptor
Type:Receptor Kinase Domain
Mol. Mass.:134279.59
Organism:Homo sapiens (Human)
Description:P00533
Residue:1210
BDBM50315887
NameBDBM50315887
Synonyms:(1s,3s)-3-(8-amino-1-(2-phenylquinolin-7-yl)imidazo[1,5-a]pyrazin-3-yl)-1-methylcyclobutanol OSI-906
TypeSmall organic molecule
Emp. Form.C26H23N5O
Mol. Mass.421.4937
SMILESC[C@@]1(O)C[C@@H](C1)c1nc(-c2ccc3ccc(nc3c2)-c2ccccc2)c2c(N)nccn12