Reaction Details
TargetInsulin receptor
LigandBDBM50010382
Substrate/Competitorn/a
Meas. Tech.ChEMBL_1353180 (CHEMBL3266282)
IC50 170±n/a nM
Citation Szokol, BGyulavári, PKurkó, IBaska, FSzántai-Kis, CGreff, ZOrfi, ZPeták, IPénzes, KTorka, RUllrich, AOrfi, LVántus, TKéri, G Discovery and Biological Evaluation of Novel Dual EGFR/c-Met Inhibitors. ACS Med Chem Lett5:298-303 (2014) 
 
Insulin receptor
Name:Insulin receptor
Type:Receptor Tyrosine Kinase
Mol. Mass.:156322.60
Organism:Homo sapiens (Human)
Description:P06213
Residue:1382
BDBM50010382
NameBDBM50010382
Synonyms:CHEMBL3263958
TypeSmall organic molecule
Emp. Form.C35H36FN5O6
Mol. Mass.641.6886
SMILESCOc1cc2c(Oc3ccc(NC(=O)c4c(C)n(C)n(-c5ccccc5)c4=O)cc3F)ccnc2cc1OCCCN1CCOCC1