Reaction Details
TargetMu-type opioid receptor
LigandBDBM50010489
Substrate/Competitorn/a
Meas. Tech.ChEMBL_1353484 (CHEMBL3269820)
Ki 0.286000±n/a nM
Citation Ballet, SBetti, CNovoa, ATömböly, CNielsen, CUHelms, HCLesniak, AKleczkowska, PChung, NNLipkowski, AWBrodin, BTourwé, DSchiller, PW In Vitro Membrane Permeation Studies and in Vivo Antinociception of Glycosylated Dmt ACS Med Chem Lett5:352-357 (2014) 
 
Mu-type opioid receptor
Name:Mu-type opioid receptor
Type:G Protein-Coupled Receptor (GPCR)
Mol. Mass.:44503.11
Organism:Rattus norvegicus (rat)
Description:Competition binding assays were carried out using membrane preparations from transfected HN9.10 cells that constitutively expressed the mu opioid receptor.
Residue:398
BDBM50010489
NameBDBM50010489
Synonyms:CHEMBL3264362
TypeSmall organic molecule
Emp. Form.C44H59N11O11
Mol. Mass.918.0064
SMILESCc1cc(O)cc(C)c1C[C@H](N)C(=O)N[C@H](CCCNC(N)=N)C(=O)N[C@@H](Cc1ccccc1)C(=O)N[C@@H](Cc1ccc(OCc2cn(nn2)[C@@H]2O[C@H](CO)[C@H](O)[C@H](O)[C@H]2O)cc1)C(N)=O