Reaction Details
TargetDelta-type opioid receptor
LigandBDBM50010488
Substrate/Competitorn/a
Meas. Tech.ChEMBL_1353485 (CHEMBL3269821)
Ki 6.4±n/a nM
Citation Ballet, SBetti, CNovoa, ATömböly, CNielsen, CUHelms, HCLesniak, AKleczkowska, PChung, NNLipkowski, AWBrodin, BTourwé, DSchiller, PW In Vitro Membrane Permeation Studies and in Vivo Antinociception of Glycosylated Dmt ACS Med Chem Lett5:352-357 (2014) 
 
Delta-type opioid receptor
Name:Delta-type opioid receptor
Type:G Protein-Coupled Receptor (GPCR)
Mol. Mass.:40465.04
Organism:Rattus norvegicus (rat)
Description:Competition binding assays were using CHO-K1 cell membranes expressing the opioid receptor.
Residue:372
BDBM50010488
NameBDBM50010488
Synonyms:CHEMBL3264361
TypeSmall organic molecule
Emp. Form.C38H55N11O11
Mol. Mass.841.9104
SMILESCc1cc(O)cc(C)c1C[C@H](N)C(=O)N[C@H](CCCNC(N)=N)C(=O)N[C@@H](Cc1ccccc1)C(=O)N[C@@H](COCc1cn(nn1)[C@@H]1O[C@H](CO)[C@H](O)[C@H](O)[C@H]1O)C(N)=O