Reaction Details
TargetPolyunsaturated fatty acid lipoxygenase ALOX15
LigandBDBM22302
Substrate/Competitorn/a
Meas. Tech.ChEMBL_1352296 (CHEMBL3269360)
IC50 21±n/a nM
Citation Rai, GJoshi, NJung, JELiu, YSchultz, LYasgar, APerry, SDiaz, GZhang, QKenyon, VJadhav, ASimeonov, ALo, EHvan Leyen, KMaloney, DJHolman, TR Potent and selective inhibitors of human reticulocyte 12/15-lipoxygenase as anti-stroke therapies. J Med Chem57:4035-48 (2014) 
 
Polyunsaturated fatty acid lipoxygenase ALOX15
Name:Polyunsaturated fatty acid lipoxygenase ALOX15
Type:Enzyme
Mol. Mass.:75309.71
Organism:Oryctolagus cuniculus (rabbit)
Description:15-LO enzyme was purified from phenylhydrazine treated rabbits.
Residue:663
BDBM22302
NameBDBM22302
Synonyms:N-{2-[2-(1-benzofuran-2-yl)-1H-indol-3-yl]ethyl}-4-pentylbenzene-1-sulfonamide | tryptamine sulfonamide, 37l
TypeSmall organic molecule
Emp. Form.C29H30N2O3S
Mol. Mass.486.625
SMILESCCCCCc1ccc(cc1)S(=O)(=O)NCCc1c([nH]c2ccccc12)-c1cc2ccccc2o1