Reaction Details
TargetPolyunsaturated fatty acid lipoxygenase ALOX15
LigandBDBM79800
Substrate/Competitorn/a
Meas. Tech.ChEMBL_1352310 (CHEMBL3269374)
Ki 1200±n/a nM
Citation Rai, GJoshi, NJung, JELiu, YSchultz, LYasgar, APerry, SDiaz, GZhang, QKenyon, VJadhav, ASimeonov, ALo, EHvan Leyen, KMaloney, DJHolman, TR Potent and selective inhibitors of human reticulocyte 12/15-lipoxygenase as anti-stroke therapies. J Med Chem57:4035-48 (2014) 
 
Polyunsaturated fatty acid lipoxygenase ALOX15
Name:Polyunsaturated fatty acid lipoxygenase ALOX15
Type:Protein
Mol. Mass.:74804.05
Organism:Homo sapiens (Human)
Description:n/a
Residue:662
BDBM79800
NameBDBM79800
Synonyms:5-(methylamino)-2-(1-naphthalenyl)-4-oxazolecarbonitrile 5-(methylamino)-2-naphthalen-1-yl-1,3-oxazole-4-carbonitrile SMR000045344 | cid_664510
TypeSmall organic molecule
Emp. Form.C15H11N3O
Mol. Mass.249.2673
SMILESCNc1oc(nc1C#N)-c1cccc2ccccc12