Reaction Details
TargetBifunctional epoxide hydrolase 2
LigandBDBM50012059
Substrate/Competitorn/a
Meas. Tech.ChEMBL_1352417 (CHEMBL3270577)
Ki 2.4±n/a nM
Citation Burmistrov, VMorisseau, CLee, KSShihadih, DSHarris, TRButov, GMHammock, BD Symmetric adamantyl-diureas as soluble epoxide hydrolase inhibitors. Bioorg Med Chem Lett24:2193-7 (2014) 
 
Bifunctional epoxide hydrolase 2
Name:Bifunctional epoxide hydrolase 2
Type:Enzyme
Mol. Mass.:62613.07
Organism:Homo sapiens (Human)
Description:P34913
Residue:555
BDBM50012059
NameBDBM50012059
Synonyms:CHEMBL3263302
TypeSmall organic molecule
Emp. Form.C30H50N4O2
Mol. Mass.498.7436
SMILESO=C(NCCCCCCCCNC(=O)NC1C2CC3CC(C2)CC1C3)NC1C2CC3CC(C2)CC1C3