Reaction Details
TargetBifunctional epoxide hydrolase 2
LigandBDBM50012011
Substrate/Competitorn/a
Meas. Tech.ChEMBL_1352419 (CHEMBL3270579)
IC50 0.700000±n/a nM
Citation Burmistrov, VMorisseau, CLee, KSShihadih, DSHarris, TRButov, GMHammock, BD Symmetric adamantyl-diureas as soluble epoxide hydrolase inhibitors. Bioorg Med Chem Lett24:2193-7 (2014) 
 
Bifunctional epoxide hydrolase 2
Name:Bifunctional epoxide hydrolase 2
Type:Enzyme
Mol. Mass.:62613.07
Organism:Homo sapiens (Human)
Description:P34913
Residue:555
BDBM50012011
NameBDBM50012011
Synonyms:CHEMBL3263289
TypeSmall organic molecule
Emp. Form.C30H50N4O2
Mol. Mass.498.7436
SMILESO=C(NCCCCCCNC(=O)NCC12CC3CC(CC(C3)C1)C2)NCC12CC3CC(CC(C3)C1)C2