Reaction Details
TargetKappa-type opioid receptor
LigandBDBM62203
Substrate/Competitorn/a
Meas. Tech.ChEMBL_1352795 (CHEMBL3268195)
IC50 15300±n/a nM
Citation Urbano, MGuerrero, MRosen, HRoberts, E Antagonists of the kappa opioid receptor. Bioorg Med Chem Lett24:2021-32 (2014) 
 
Kappa-type opioid receptor
Name:Kappa-type opioid receptor
Type:G Protein-Coupled Receptor (GPCR)
Mol. Mass.:42648.76
Organism:Homo sapiens (Human)
Description:P41145
Residue:380
BDBM62203
NameBDBM62203
Synonyms:2-(4-ketopyrrolo[1,2-a]quinoxalin-5-yl)-N-[3-[4-(4-methoxyphenyl)piperazino]propyl]acetamide N-[3-[4-(4-methoxyphenyl)-1-piperazinyl]propyl]-2-(4-oxo-5-pyrrolo[1,2-a]quinoxalinyl)acetamide N-[3-[4-(4-methoxyphenyl)piperazin-1-yl]propyl]-2-(4-oxopyrrolo[1,2-a]quinoxalin-5-yl)acetamide | cid_22522554
TypeSmall organic molecule
Emp. Form.C27H31N5O3
Mol. Mass.473.5667
SMILESCOc1ccc(cc1)N1CCN(CCCNC(=O)Cn2c3ccccc3n3cccc3c2=O)CC1