Reaction Details
TargetKappa-type opioid receptor
LigandBDBM71619
Substrate/Competitorn/a
Meas. Tech.ChEMBL_1352795 (CHEMBL3268195)
IC50 700±n/a nM
Citation Urbano, MGuerrero, MRosen, HRoberts, E Antagonists of the kappa opioid receptor. Bioorg Med Chem Lett24:2021-32 (2014) 
 
Kappa-type opioid receptor
Name:Kappa-type opioid receptor
Type:G Protein-Coupled Receptor (GPCR)
Mol. Mass.:42648.76
Organism:Homo sapiens (Human)
Description:P41145
Residue:380
BDBM71619
NameBDBM71619
Synonyms:KSC-1-278 cid_45100475
TypeSmall organic molecule
Emp. Form.C26H29BrN6O3
Mol. Mass.553.451
SMILESCOc1ccc(cc1)N1CCN(CCCNC(=O)Cn2c3ncc(Br)cc3n3cccc3c2=O)CC1