Reaction Details
TargetMu-type opioid receptor
LigandBDBM71610
Substrate/Competitorn/a
Meas. Tech.ChEMBL_1352793 (CHEMBL3268193)
IC50>32000±n/a nM
Citation Urbano, MGuerrero, MRosen, HRoberts, E Antagonists of the kappa opioid receptor. Bioorg Med Chem Lett24:2021-32 (2014) 
 
Mu-type opioid receptor
Name:Mu-type opioid receptor
Type:G Protein-Coupled Receptor (GPCR)
Mol. Mass.:44789.51
Organism:Homo sapiens (Human)
Description:P35372
Residue:400
BDBM71610
NameBDBM71610
Synonyms:KSC-1-256 ML190 | cid_44665680
TypeSmall organic molecule
Emp. Form.C27H32N6O3
Mol. Mass.488.5814
SMILESCOc1ccc(cc1)N1CCN(CCCNC(=O)Cn2c3nccc(C)c3n3cccc3c2=O)CC1