Reaction Details
TargetMu-type opioid receptor
LigandBDBM50012149
Substrate/Competitorn/a
Meas. Tech.ChEMBL_1352781 (CHEMBL3268181)
IC50 343±n/a nM
Citation Urbano, MGuerrero, MRosen, HRoberts, E Antagonists of the kappa opioid receptor. Bioorg Med Chem Lett24:2021-32 (2014) 
 
Mu-type opioid receptor
Name:Mu-type opioid receptor
Type:G Protein-Coupled Receptor (GPCR)
Mol. Mass.:44789.51
Organism:Homo sapiens (Human)
Description:P35372
Residue:400
BDBM50012149
NameBDBM50012149
Synonyms:CHEMBL3264446 US9682966, 105
TypeSmall organic molecule
Emp. Form.C18H26BrN3O3
Mol. Mass.412.321
SMILESCOC(=O)c1cc(Br)cnc1N1CC[C@@H](NC2CCCCC2)[C@H](O)C1