Reaction Details
TargetMu-type opioid receptor
LigandBDBM50012150
Substrate/Competitorn/a
Meas. Tech.ChEMBL_1352784 (CHEMBL3268184)
Ki 186±n/a nM
Citation Urbano, MGuerrero, MRosen, HRoberts, E Antagonists of the kappa opioid receptor. Bioorg Med Chem Lett24:2021-32 (2014) 
 
Mu-type opioid receptor
Name:Mu-type opioid receptor
Type:G Protein-Coupled Receptor (GPCR)
Mol. Mass.:44789.51
Organism:Homo sapiens (Human)
Description:P35372
Residue:400
BDBM50012150
NameBDBM50012150
Synonyms:CHEMBL3264439
TypeSmall organic molecule
Emp. Form.C25H32N2O4
Mol. Mass.424.5326
SMILESC[C@H]1CN(CCOC(=O)[C@H]2Cc3ccc(O)cc3CN2)CC[C@@]1(C)c1cccc(O)c1