Reaction Details
TargetDelta-type opioid receptor
LigandBDBM54817
Substrate/Competitorn/a
Meas. Tech.ChEMBL_1352796 (CHEMBL3268196)
IC50>32000±n/a nM
Citation Urbano, MGuerrero, MRosen, HRoberts, E Antagonists of the kappa opioid receptor. Bioorg Med Chem Lett24:2021-32 (2014) 
 
Delta-type opioid receptor
Name:Delta-type opioid receptor
Type:G Protein-Coupled Receptor (GPCR)
Mol. Mass.:40382.98
Organism:Homo sapiens (Human)
Description:Competition binding assays were carried out using membrane preparations from transfected HN9.10 cells that constitutively expressed the delta opioid receptor.
Residue:372
BDBM54817
NameBDBM54817
Synonyms:4-[[(4-methylphenyl)sulfonylamino]methyl]-N-[2-[(phenylmethyl)-propan-2-yl-amino]ethyl]benzamide MLS000682490 N-[2-[benzyl(propan-2-yl)amino]ethyl]-4-[[(4-methylphenyl)sulfonylamino]methyl]benzamide SMR000314971 | cid_3342390
TypeSmall organic molecule
Emp. Form.C27H33N3O3S
Mol. Mass.479.634
SMILESCC(C)N(CCNC(=O)c1ccc(CNS(=O)(=O)c2ccc(C)cc2)cc1)Cc1ccccc1