Reaction Details
TargetDelta-type opioid receptor
LigandBDBM75566
Substrate/Competitorn/a
Meas. Tech.ChEMBL_1352796 (CHEMBL3268196)
IC50>32000±n/a nM
Citation Urbano, MGuerrero, MRosen, HRoberts, E Antagonists of the kappa opioid receptor. Bioorg Med Chem Lett24:2021-32 (2014) 
 
Delta-type opioid receptor
Name:Delta-type opioid receptor
Type:G Protein-Coupled Receptor (GPCR)
Mol. Mass.:40382.98
Organism:Homo sapiens (Human)
Description:Competition binding assays were carried out using membrane preparations from transfected HN9.10 cells that constitutively expressed the delta opioid receptor.
Residue:372
BDBM75566
NameBDBM75566
Synonyms:KSC-11-114-1 N-[2-[benzyl(tert-butyl)amino]ethyl]-4-[(tosylamino)methyl]benzamide N-[2-[tert-butyl-(phenylmethyl)amino]ethyl]-4-[[(4-methylphenyl)sulfonylamino]methyl]benzamide | cid_45115589
TypeSmall organic molecule
Emp. Form.C28H35N3O3S
Mol. Mass.493.661
SMILESCc1ccc(cc1)S(=O)(=O)NCc1ccc(cc1)C(=O)NCCN(Cc1ccccc1)C(C)(C)C