Reaction Details
TargetSodium-dependent noradrenaline transporter
LigandBDBM71610
Substrate/Competitorn/a
Meas. Tech.ChEMBL_1352904 (CHEMBL3269421)
Ki<1000±n/a nM
Citation Urbano, MGuerrero, MRosen, HRoberts, E Antagonists of the kappa opioid receptor. Bioorg Med Chem Lett24:2021-32 (2014) 
 
Sodium-dependent noradrenaline transporter
Name:Sodium-dependent noradrenaline transporter
Type:Multi-pass membrane protein
Mol. Mass.:69337.72
Organism:Homo sapiens (Human)
Description:P23975
Residue:617
BDBM71610
NameBDBM71610
Synonyms:KSC-1-256 ML190 | cid_44665680
TypeSmall organic molecule
Emp. Form.C27H32N6O3
Mol. Mass.488.5814
SMILESCOc1ccc(cc1)N1CCN(CCCNC(=O)Cn2c3nccc(C)c3n3cccc3c2=O)CC1