Reaction Details
TargetDelta-type opioid receptor
LigandBDBM50012155
Substrate/Competitorn/a
Meas. Tech.ChEMBL_1352791 (CHEMBL3268191)
EC50>5000±n/a nM
Citation Urbano, MGuerrero, MRosen, HRoberts, E Antagonists of the kappa opioid receptor. Bioorg Med Chem Lett24:2021-32 (2014) 
 
Delta-type opioid receptor
Name:Delta-type opioid receptor
Type:G Protein-Coupled Receptor (GPCR)
Mol. Mass.:40382.98
Organism:Homo sapiens (Human)
Description:Competition binding assays were carried out using membrane preparations from transfected HN9.10 cells that constitutively expressed the delta opioid receptor.
Residue:372
BDBM50012155
NameBDBM50012155
Synonyms:CHEMBL3264442
TypeSmall organic molecule
Emp. Form.C28H38N2O
Mol. Mass.418.6141
SMILESCC1CN(CCCc2ccccc2)C2C[C@@H](CC1(C2)c1cccc(O)c1)NCC1CC1