Reaction Details
TargetKappa-type opioid receptor
LigandBDBM65828
Substrate/Competitorn/a
Meas. Tech.ChEMBL_1352794 (CHEMBL3268194)
IC50 1120±n/a nM
Citation Urbano, MGuerrero, MRosen, HRoberts, E Antagonists of the kappa opioid receptor. Bioorg Med Chem Lett24:2021-32 (2014) 
 
Kappa-type opioid receptor
Name:Kappa-type opioid receptor
Type:G Protein-Coupled Receptor (GPCR)
Mol. Mass.:42648.76
Organism:Homo sapiens (Human)
Description:P41145
Residue:380
BDBM65828
NameBDBM65828
Synonyms:4-[[(4-ethylphenyl)sulfonylamino]methyl]-N-[2-[(phenylmethyl)-propan-2-yl-amino]ethyl]benzamide KSC-5-234 N-[2-[benzyl(isopropyl)amino]ethyl]-4-[[(4-ethylphenyl)sulfonylamino]methyl]benzamide cid_44601476
TypeSmall organic molecule
Emp. Form.C28H35N3O3S
Mol. Mass.493.661
SMILESCCc1ccc(cc1)S(=O)(=O)NCc1ccc(cc1)C(=O)NCCN(Cc1ccccc1)C(C)C