Reaction Details
TargetKappa-type opioid receptor
LigandBDBM65830
Substrate/Competitorn/a
Meas. Tech.ChEMBL_1352794 (CHEMBL3268194)
IC50>20000±n/a nM
Citation Urbano, MGuerrero, MRosen, HRoberts, E Antagonists of the kappa opioid receptor. Bioorg Med Chem Lett24:2021-32 (2014) 
 
Kappa-type opioid receptor
Name:Kappa-type opioid receptor
Type:G Protein-Coupled Receptor (GPCR)
Mol. Mass.:42648.76
Organism:Homo sapiens (Human)
Description:P41145
Residue:380
BDBM65830
NameBDBM65830
Synonyms:4-[[(4-methylphenyl)sulfonylamino]methyl]-N-[3-[(phenylmethyl)-propan-2-yl-amino]propyl]benzamide KSC-5-249 N-[3-[benzyl(isopropyl)amino]propyl]-4-[(tosylamino)methyl]benzamide cid_20968607
TypeSmall organic molecule
Emp. Form.C28H35N3O3S
Mol. Mass.493.661
SMILESCC(C)N(CCCNC(=O)c1ccc(CNS(=O)(=O)c2ccc(C)cc2)cc1)Cc1ccccc1