Reaction Details
TargetProstaglandin E2 receptor EP4 subtype
LigandBDBM50012325
Substrate/Competitorn/a
Meas. Tech.ChEMBL_1351394 (CHEMBL3266970)
Ki 80±n/a nM
Citation Sutton, JClark, DEHiggs, Cde Groot, MJHarris, NVTaylor, ALockey, PMMaubach, KWoodrooffe, ADavis, RJColeman, RAClark, KL From virtual to clinical: The discovery of PGN-1531, a novel antagonist of the prostanoid EP4 receptor. Bioorg Med Chem Lett24:2212-21 (2014) 
 
Prostaglandin E2 receptor EP4 subtype
Name:Prostaglandin E2 receptor EP4 subtype
Type:Enzyme
Mol. Mass.:53134.53
Organism:Homo sapiens (Human)
Description:P35408
Residue:488
BDBM50012325
NameBDBM50012325
Synonyms:CHEMBL3260431
TypeSmall organic molecule
Emp. Form.C21H20O4
Mol. Mass.336.3811
SMILESCc1oc(CCC(O)=O)cc1COc1ccc(cc1)-c1ccccc1