Reaction Details
TargetProstaglandin E2 receptor EP4 subtype
LigandBDBM50012538
Substrate/Competitorn/a
Meas. Tech.ChEMBL_1351394 (CHEMBL3266970)
Ki 115±n/a nM
Citation Sutton, JClark, DEHiggs, Cde Groot, MJHarris, NVTaylor, ALockey, PMMaubach, KWoodrooffe, ADavis, RJColeman, RAClark, KL From virtual to clinical: The discovery of PGN-1531, a novel antagonist of the prostanoid EP4 receptor. Bioorg Med Chem Lett24:2212-21 (2014) 
 
Prostaglandin E2 receptor EP4 subtype
Name:Prostaglandin E2 receptor EP4 subtype
Type:Enzyme
Mol. Mass.:53134.53
Organism:Homo sapiens (Human)
Description:P35408
Residue:488
BDBM50012538
NameBDBM50012538
Synonyms:CHEMBL3260762
TypeSmall organic molecule
Emp. Form.C22H24N2O6S
Mol. Mass.444.501
SMILESCOc1ccc(cc1)-c1ccc(OCc2cc(oc2C)C(=O)NS(=O)(=O)N(C)C)cc1