Reaction Details
TargetProstaglandin E2 receptor EP4 subtype
LigandBDBM50012542
Substrate/Competitorn/a
Meas. Tech.ChEMBL_1351394 (CHEMBL3266970)
Ki 2.0±n/a nM
Citation Sutton, JClark, DEHiggs, Cde Groot, MJHarris, NVTaylor, ALockey, PMMaubach, KWoodrooffe, ADavis, RJColeman, RAClark, KL From virtual to clinical: The discovery of PGN-1531, a novel antagonist of the prostanoid EP4 receptor. Bioorg Med Chem Lett24:2212-21 (2014) 
 
Prostaglandin E2 receptor EP4 subtype
Name:Prostaglandin E2 receptor EP4 subtype
Type:Enzyme
Mol. Mass.:53134.53
Organism:Homo sapiens (Human)
Description:P35408
Residue:488
BDBM50012542
NameBDBM50012542
Synonyms:CHEMBL3260766
TypeSmall organic molecule
Emp. Form.C26H24N2O4S
Mol. Mass.460.545
SMILESCc1oc(cc1CNc1ccc(cc1)-c1ccccc1)C(=O)NS(=O)(=O)c1ccccc1C