Reaction Details
TargetVitamin D3 receptor
LigandBDBM50013612
Substrate/Competitorn/a
Meas. Tech.ChEMBL_1349194 (CHEMBL3267968)
IC50 0.290000±n/a nM
Citation Anami, YItoh, TEgawa, DYoshimoto, NYamamoto, K A mixed population of antagonist and agonist binding conformers in a single crystal explains partial agonism against vitamin D receptor: active vitamin D analogues with 22R-alkyl group. J Med Chem57:4351-67 (2014) 
 
Vitamin D3 receptor
Name:Vitamin D3 receptor
Type:Protein
Mol. Mass.:48288.72
Organism:Homo sapiens (Human)
Description:P11473
Residue:427
BDBM50013612
NameBDBM50013612
Synonyms:CHEMBL3264166
TypeSmall organic molecule
Emp. Form.C31H52O3
Mol. Mass.472.7428
SMILES[H][C@@]1([#6]-[#6][C@@]2([H])\[#6](-[#6]-[#6]-[#6][C@]12[#6])=[#6]\[#6]=[#6]-1/[#6]-[#6@@H](-[#8])-[#6](=[#6])-[#6@H](-[#8])-[#6]-1)[#6@H](-[#6])-[#6@H](-[#6]-[#6]-[#6]-[#6])-[#6]-[#6]C([#6])([#6])[#8]