Reaction Details
Target5-hydroxytryptamine receptor 3A
LigandBDBM50014556
Substrate/Competitorn/a
Meas. Tech.ChEMBL_1350968 (CHEMBL3268497)
Ki 5.7±n/a nM
Citation Manning, DDGuo, CZhang, ZRyan, KNNaginskaya, JChoo, SHMasih, LEarley, WGWierschke, JDNewman, ASBrady, CABarnes, NMGuzzo, PR The discovery of diazepinone-based 5-HT3 receptor partial agonists. Bioorg Med Chem Lett24:2578-81 (2014) 
 
5-hydroxytryptamine receptor 3A
Name:5-hydroxytryptamine receptor 3A
Type:Protein
Mol. Mass.:55283.27
Organism:Homo sapiens (Human)
Description:P46098
Residue:478
BDBM50014556
NameBDBM50014556
Synonyms:CHEMBL3261486 | US9045501, 25
TypeSmall organic molecule
Emp. Form.C17H20N4O2
Mol. Mass.312.3663
SMILESO=C1N(CCn2c3c1cccc3[nH]c2=O)[C@@H]1CN2CCC1CC2