Reaction Details
Target5-hydroxytryptamine receptor 7
LigandBDBM50015022
Substrate/Competitorn/a
Meas. Tech.ChEMBL_1349423 (CHEMBL3270013)
Ki 179±n/a nM
Citation Spadoni, GBedini, ABartolucci, SPala, DMor, MRiccioni, TBorsini, FCabri, WCelona, DMarzi, MTarzia, GRivara, SMinetti, P Towards the development of 5-HT7 ligands combining serotonin-like and arylpiperazine moieties. Eur J Med Chem80:8-35 (2014) 
 
5-hydroxytryptamine receptor 7
Name:5-hydroxytryptamine receptor 7
Type:G Protein-Coupled Receptor (GPCR)
Mol. Mass.:53573.08
Organism:Homo sapiens (Human)
Description:P34969
Residue:479
BDBM50015022
NameBDBM50015022
Synonyms:CHEMBL3262414
TypeSmall organic molecule
Emp. Form.C20H26ClN3
Mol. Mass.343.894
SMILESCN(CCCN1CCN(CC1)c1ccccc1)c1cccc(Cl)c1