Reaction Details
TargetHistone deacetylase 1
LigandBDBM50015235
Substrate/Competitorn/a
Meas. Tech.ChEMBL_1349594 (CHEMBL3265663)
IC50 4850±n/a nM
Citation Lee, HYTsai, ACChen, MCShen, PJCheng, YCKuo, CCPan, SLLiu, YMLiu, JFYeh, TKWang, JCChang, CYChang, JYLiou, JP Azaindolylsulfonamides, with a more selective inhibitory effect on histone deacetylase 6 activity, exhibit antitumor activity in colorectal cancer HCT116 cells. J Med Chem57:4009-22 (2014) 
 
Histone deacetylase 1
Name:Histone deacetylase 1
Type:Enzyme
Mol. Mass.:55090.27
Organism:Homo sapiens (Human)
Description:Q13547
Residue:482
BDBM50015235
NameBDBM50015235
Synonyms:CHEMBL3262725
TypeSmall organic molecule
Emp. Form.C16H13N3O4S
Mol. Mass.343.357
SMILESONC(=O)\C=C\c1cccc(c1)S(=O)(=O)n1ccc2ccncc12