Reaction Details
TargetTyrosine-protein kinase ITK/TSK
LigandBDBM50015268
Substrate/Competitorn/a
Meas. Tech.ChEMBL_1349759 (CHEMBL3267591)
Ki 0.230000±n/a nM
Citation Pastor, RMBurch, JDMagnuson, SOrtwine, DFChen, YDe La Torre, KDing, XEigenbrot, CJohnson, ALiimatta, MLiu, YShia, SWang, XWu, LCPei, Z Discovery and optimization of indazoles as potent and selective interleukin-2 inducible T cell kinase (ITK) inhibitors. Bioorg Med Chem Lett24:2448-52 (2014) 
 
Tyrosine-protein kinase ITK/TSK
Name:Tyrosine-protein kinase ITK/TSK
Type:Protein
Mol. Mass.:71839.20
Organism:Homo sapiens (Human)
Description:Q08881
Residue:620
BDBM50015268
NameBDBM50015268
Synonyms:CHEMBL3263055
TypeSmall organic molecule
Emp. Form.C24H23N7O2
Mol. Mass.441.4851
SMILESCC(C)(O)[C@@H](c1ccccc1)n1cc(NC(=O)c2n[nH]c3cc(ccc23)-c2cn[nH]c2)cn1