Reaction Details
TargetP2Y purinoceptor 1
LigandBDBM50015294
Substrate/Competitorn/a
Meas. Tech.ChEMBL_1349774 (CHEMBL3267606)
Ki 13±n/a nM
Citation Hu, CHQiao, JXHan, YWang, TCHua, JPrice, LAWu, QShen, HHuang, CSRehfuss, RWexler, RRLam, PY 2-Amino-1,3,4-thiadiazoles in the 7-hydroxy-N-neopentyl spiropiperidine indolinyl series as potent P2Y1 receptor antagonists. Bioorg Med Chem Lett24:2481-5 (2014) 
 
P2Y purinoceptor 1
Name:P2Y purinoceptor 1
Type:Enzyme
Mol. Mass.:42090.25
Organism:Homo sapiens (Human)
Description:P47900
Residue:373
BDBM50015294
NameBDBM50015294
Synonyms:CHEMBL3263074 | US9120798, 21
TypeSmall organic molecule
Emp. Form.C31H33Cl2N5OS
Mol. Mass.594.598
SMILESCC(C)(C)CN1CCC2(CN(c3c2c(Cl)ccc3O)c2ccccc2Nc2nnc(s2)-c2ccc(Cl)cc2)CC1