Reaction Details
TargetP2Y purinoceptor 1
LigandBDBM50015277
Substrate/Competitorn/a
Meas. Tech.ChEMBL_1349775 (CHEMBL3267607)
IC50 0.190000±n/a nM
Citation Hu, CHQiao, JXHan, YWang, TCHua, JPrice, LAWu, QShen, HHuang, CSRehfuss, RWexler, RRLam, PY 2-Amino-1,3,4-thiadiazoles in the 7-hydroxy-N-neopentyl spiropiperidine indolinyl series as potent P2Y1 receptor antagonists. Bioorg Med Chem Lett24:2481-5 (2014) 
 
P2Y purinoceptor 1
Name:P2Y purinoceptor 1
Type:Enzyme
Mol. Mass.:42090.25
Organism:Homo sapiens (Human)
Description:P47900
Residue:373
BDBM50015277
NameBDBM50015277
Synonyms:CHEMBL3263057 | US9120798, 1
TypeSmall organic molecule
Emp. Form.C32H34F3N5OS
Mol. Mass.593.705
SMILESCC(C)(C)CN1CCC2(CN(c3c2c(ccc3O)C(F)(F)F)c2ccccc2Nc2nnc(s2)-c2ccccc2)CC1