Reaction Details
TargetP2Y purinoceptor 1
LigandBDBM50015278
Substrate/Competitorn/a
Meas. Tech.ChEMBL_1349775 (CHEMBL3267607)
IC50 6.4±n/a nM
Citation Hu, CHQiao, JXHan, YWang, TCHua, JPrice, LAWu, QShen, HHuang, CSRehfuss, RWexler, RRLam, PY 2-Amino-1,3,4-thiadiazoles in the 7-hydroxy-N-neopentyl spiropiperidine indolinyl series as potent P2Y1 receptor antagonists. Bioorg Med Chem Lett24:2481-5 (2014) 
 
P2Y purinoceptor 1
Name:P2Y purinoceptor 1
Type:Enzyme
Mol. Mass.:42090.25
Organism:Homo sapiens (Human)
Description:P47900
Residue:373
BDBM50015278
NameBDBM50015278
Synonyms:CHEMBL3263058 | US9120798, 35
TypeSmall organic molecule
Emp. Form.C31H34ClN5OS
Mol. Mass.560.153
SMILESCC(C)(C)CN1CCC2(CN(c3c2c(Cl)ccc3O)c2ccccc2Nc2nc(ns2)-c2ccccc2)CC1