Reaction Details
TargetLegumain
LigandBDBM50015362
Substrate/Competitorn/a
Meas. Tech.ChEMBL_1347909 (CHEMBL3267446)
IC50 0.900000±n/a nM
Citation Higgins, CBouazzaoui, SGaddale, KD'Costa, ZTempleman, AO'Rourke, MYoung, AScott, CHarrison, TMullan, PWilliams, R P3 SAR exploration of biphenyl carbamate based Legumain inhibitors. Bioorg Med Chem Lett24:2521-4 (2014) 
 
Legumain
Name:Legumain
Type:n/a
Mol. Mass.:49411.12
Organism:Homo sapiens (Human)
Description:n/a
Residue:433
BDBM50015362
NameBDBM50015362
Synonyms:CHEMBL3264590
TypeSmall organic molecule
Emp. Form.C25H28N4O5
Mol. Mass.464.5136
SMILESCCOc1cccc(c1)-c1ccc(COC(=O)N2CCC[C@H]2C(=O)N[C@@H](CC(N)=O)C#N)cc1