Reaction Details
TargetCytochrome P450 2C19
LigandBDBM50015639
Substrate/Competitorn/a
Meas. Tech.ChEMBL_1349494 (CHEMBL3271177)
IC50>10000±n/a nM
Citation Jin, CHKrishnaiah, MSreenu, DSubrahmanyam, VBRao, KSLee, HJPark, SJPark, HJLee, KSheen, YYKim, DK Discovery of N-((4-([1,2,4]triazolo[1,5-a]pyridin-6-yl)-5-(6-methylpyridin-2-yl)-1H-imidazol-2-yl)methyl)-2-fluoroaniline (EW-7197): a highly potent, selective, and orally bioavailable inhibitor of TGF-ß type I receptor kinase as cancer immunotherapeutic/antifibrotic agent. J Med Chem57:4213-38 (2014) 
 
Cytochrome P450 2C19
Name:Cytochrome P450 2C19
Type:Enzyme
Mol. Mass.:55935.47
Organism:Homo sapiens (Human)
Description:P33261
Residue:490
BDBM50015639
NameBDBM50015639
Synonyms:CHEMBL3260567 | USRE47141, Example 2
TypeSmall organic molecule
Emp. Form.C22H18FN7
Mol. Mass.399.4236
SMILESCc1cccc(n1)-c1[nH]c(CNc2ccccc2F)nc1-c1ccc2ncnn2c1