Reaction Details
TargetSigma non-opioid intracellular receptor 1
LigandBDBM50016261
Substrate/Competitorn/a
Meas. Tech.ChEMBL_1348487 (CHEMBL3266802)
Ki 7463±n/a nM
Citation Bai, SLi, SXu, JPeng, XSai, KChu, WTu, ZZeng, CMach, RH Synthesis and structure-activity relationship studies of conformationally flexible tetrahydroisoquinolinyl triazole carboxamide and triazole substituted benzamide analogues ass2 receptor ligands. J Med Chem57:4239-51 (2014) 
 
Sigma non-opioid intracellular receptor 1
Name:Sigma non-opioid intracellular receptor 1
Type:Enzyme Catalytic Domain
Mol. Mass.:25124.85
Organism:Homo sapiens (Human)
Description:Q99720
Residue:223
BDBM50016261
NameBDBM50016261
Synonyms:CHEMBL3262794
TypeSmall organic molecule
Emp. Form.C22H23Cl2NO
Mol. Mass.388.33
SMILES[H][C@@]12C[C@](CCN1C)(CC\C2=C\c1ccc(Cl)c(Cl)c1)c1cccc(O)c1