Reaction Details
TargetSigma non-opioid intracellular receptor 1
LigandBDBM50016272
Substrate/Competitorn/a
Meas. Tech.ChEMBL_1348915 (CHEMBL3271546)
Ki 3345±n/a nM
Citation Bai, SLi, SXu, JPeng, XSai, KChu, WTu, ZZeng, CMach, RH Synthesis and structure-activity relationship studies of conformationally flexible tetrahydroisoquinolinyl triazole carboxamide and triazole substituted benzamide analogues ass2 receptor ligands. J Med Chem57:4239-51 (2014) 
 
Sigma non-opioid intracellular receptor 1
Name:Sigma non-opioid intracellular receptor 1
Type:Protein
Mol. Mass.:25307.17
Organism:Cavia porcellus (Guinea pig)
Description:Q60492
Residue:223
BDBM50016272
NameBDBM50016272
Synonyms:CHEMBL3262523
TypeSmall organic molecule
Emp. Form.C26H33N5O4
Mol. Mass.479.5713
SMILESCOc1ccc(Cn2cc(nn2)C(=O)NCCCCN2CCc3cc(OC)c(OC)cc3C2)cc1