Reaction Details
TargetD(3) dopamine receptor
LigandBDBM50007518
Substrate/Competitorn/a
Meas. Tech.ChEMBL_1347652 (CHEMBL3270691)
Ki 0.134000±n/a nM
Citation Chen, JLevant, BJiang, CKeck, TMNewman, AHWang, S Tranylcypromine substituted cis-hydroxycyclobutylnaphthamides as potent and selective dopamine D3 receptor antagonists. J Med Chem57:4962-8 (2014) 
 
D(3) dopamine receptor
Name:D(3) dopamine receptor
Type:n/a
Mol. Mass.:44243.43
Organism:Homo sapiens (Human)
Description:n/a
Residue:400
BDBM50007518
NameBDBM50007518
Synonyms:(S)-3-chloro-5-ethyl-N-((1-ethylpyrrolidin-2-yl)methyl)-6-hydroxy-2-methoxybenzamide 3-Chloro-5-ethyl-N-((S)-1-ethyl-pyrrolidin-2-ylmethyl)-6-hydroxy-2-methoxy-benzamide 3-Chloro-5-ethyl-N-(1-ethyl-pyrrolidin-2-ylmethyl)-6-hydroxy-2-methoxy-benzamide (etichlopride) 3-chloro-5-ethyl-N-{[(2S)-1-ethylpyrrolidin-2-yl]methyl}-6-hydroxy-2-methoxybenzamide ETICLOPRIDE Eticlopride;3-Chloro-5-ethyl-N-(1-ethyl-pyrrolidin-2-ylmethyl)-6-hydroxy-2-methoxy-benzamide
TypeSmall organic molecule
Emp. Form.C17H25ClN2O3
Mol. Mass.340.845
SMILESCCN1CCC[C@H]1CNC(=O)c1c(O)c(CC)cc(Cl)c1OC