Reaction Details
TargetGlandular kallikrein
LigandBDBM50016527
Substrate/Competitorn/a
Meas. Tech.ChEMBL_1354676 (CHEMBL3281101)
Ki 3400±n/a nM
Citation Geratz, JDCheng, MCTidwell, RR Novel bis(benzamidino) compounds with an aromatic central link. Inhibitors of thrombin, pancreatic kallikrein, trypsin, and complement. J Med Chem19:634-9 (1976) Glandular kallikrein
Name:Glandular kallikrein
Type:PROTEIN
Mol. Mass.:26710.38
Organism:Sus scrofa
Description:ChEMBL_108296
Residue:242
BDBM50016527
NameBDBM50016527
Synonyms:CHEMBL3277924
TypeSmall organic molecule
Emp. Form.C22H19Cl5N4O2
Mol. Mass.548.677
SMILESCl.NC(=N)c1ccc(OCc2c(Cl)c(Cl)c(COc3ccc(cc3)C(N)=N)c(Cl)c2Cl)cc1