Reaction Details
TargetGlandular kallikrein
LigandBDBM50379838
Substrate/Competitorn/a
Meas. Tech.ChEMBL_1354677 (CHEMBL3281102)
Ki 610±n/a nM
Citation Geratz, JDCheng, MCTidwell, RR Novel bis(benzamidino) compounds with an aromatic central link. Inhibitors of thrombin, pancreatic kallikrein, trypsin, and complement. J Med Chem19:634-9 (1976) Glandular kallikrein
Name:Glandular kallikrein
Type:PROTEIN
Mol. Mass.:26710.38
Organism:Sus scrofa
Description:ChEMBL_108296
Residue:242
BDBM50379838
NameBDBM50379838
Synonyms:CHEMBL2011750
TypeSmall organic molecule
Emp. Form.C22H20I2N4O2
Mol. Mass.626.2287
SMILESNC(=N)c1ccc(OCc2ccc(COc3ccc(cc3I)C(N)=N)cc2)c(I)c1