Reaction Details
TargetThymidylate synthase
LigandBDBM50016789
Substrate/Competitorn/a
Meas. Tech.ChEMBL_1357879 (CHEMBL3285766)
IC50 1000±n/a nM
Citation Chaykovsky, MHirst, MLazarus, HMartinelli, JE Methotrexate analogues. 9. Synthesis and biological properties of some 8-alkyl-7,8-dihydro analogues. J Med Chem20:1323-7 (1977) Thymidylate synthase
Name:Thymidylate synthase
Type:Enzyme
Mol. Mass.:36576.54
Organism:Lactobacillus casei
Description:n/a
Residue:316
BDBM50016789
NameBDBM50016789
Synonyms:CHEMBL3273846
TypeSmall organic molecule
Emp. Form.C20H24N8O5
Mol. Mass.456.4552
SMILESCN(CC1=Nc2c(N)nc(N)nc2NC1)c1ccc(cc1)C(=O)N[C@@H](CCC(O)=O)C(O)=O