Reaction Details
TargetDihydrofolate reductase
LigandBDBM50016801
Substrate/Competitorn/a
Meas. Tech.ChEMBL_1357878 (CHEMBL3285765)
IC50 380±n/a nM
Citation Chaykovsky, MHirst, MLazarus, HMartinelli, JE Methotrexate analogues. 9. Synthesis and biological properties of some 8-alkyl-7,8-dihydro analogues. J Med Chem20:1323-7 (1977) Dihydrofolate reductase
Name:Dihydrofolate reductase
Type:PROTEIN
Mol. Mass.:18437.08
Organism:Lactobacillus casei
Description:ChEMBL_1357878
Residue:163
BDBM50016801
NameBDBM50016801
Synonyms:CHEMBL3273849
TypeSmall organic molecule
Emp. Form.C24H32N8O5
Mol. Mass.512.5615
SMILESCCCCN1CC(CN(C)c2ccc(cc2)C(=O)N[C@@H](CCC(O)=O)C(O)=O)=Nc2c(N)nc(N)nc12