Reaction Details
TargetThymidylate synthase
LigandBDBM50010239
Substrate/Competitorn/a
Meas. Tech.ChEMBL_1358288 (CHEMBL3284705)
Ki 190±n/a nM
Citation Wataya, YSanti, DVHansch, C Inhibition of Lactobacillus casei thymidylate synthetase by 5-substituted 2'-deoxyuridylates. Preliminary quantitative structure-activity relationship. J Med Chem20:1469-73 (1977) Thymidylate synthase
Name:Thymidylate synthase
Type:Enzyme
Mol. Mass.:36576.54
Organism:Lactobacillus casei
Description:n/a
Residue:316
BDBM50010239
NameBDBM50010239
Synonyms:CHEMBL1236538
TypeSmall organic molecule
Emp. Form.C9H12ClN2O8P
Mol. Mass.342.627
SMILESO[C@H]1C[C@@H](O[C@@H]1COP(O)(O)=O)n1cc(Cl)c(=O)[nH]c1=O