Reaction Details
TargetProstaglandin D2 receptor
LigandBDBM85184
Substrate/Competitorn/a
Meas. Tech.ChEMBL_1364730 (CHEMBL3293991)
Ki 1400±n/a nM
Citation Ganesh, T Prostanoid receptor EP2 as a therapeutic target. J Med Chem57:4454-65 (2014) 
 
Prostaglandin D2 receptor
Name:Prostaglandin D2 receptor
Type:Enzyme
Mol. Mass.:40288.87
Organism:Homo sapiens (Human)
Description:Q13258
Residue:359
BDBM85184
NameBDBM85184
Synonyms:AH-6809 NSC_119461
TypeSmall organic molecule
Emp. Form.C17H14O5
Mol. Mass.298.2901
SMILESCC(C)Oc1ccc2c(c1)oc1ccc(cc1c2=O)C(O)=O